*KEYWORD
*NODE
*CONSTRAINED_NODAL_RIGID_BODY
*ELEMENT_SHELL
*ELEMENT_SOLID
*PART
Base_Cushion_Skin
*SECTION_SHELL_TITLE
Base_Cushion_Skin
*PART
Base_Cushion_Solid
*SECTION_SOLID_TITLE
Base_Cushion_Solid
*PART
SECTION_SHELL
*SECTION_SHELL_TITLE
SECTION_SHELL
*PART
Back_Cushion_Skin
*SECTION_SHELL_TITLE
Back_Cushion_Skin
*PART
PSHELL
*SECTION_SHELL_TITLE
PSHELL
*PART
HEAD_REST
*SECTION_SHELL_TITLE
HEAD_REST
*PART
Default PSHELL Property_Volume_7
*SECTION_SOLID_TITLE
Default PSHELL Property_Volume_7
*PART
Back_Cushion_Skin
*SECTION_SOLID_TITLE
Back_Cushion_Skin
*MAT_ELASTIC_TITLE
Default MAT1 MAT_ELASTIC
*MAT_FU_CHANG_FOAM_TITLE
RG60
*MAT_PIECEWISE_LINEAR_PLASTICITY_TITLE
Seat_Cushion
*MAT_ELASTIC_TITLE
Default MAT1 Material
*DEFINE_TABLE_TITLE
RG60
*DEFINE_CURVE_TITLE
RG60_0x00mm/ms
*DEFINE_CURVE_TITLE
RG60_0x0535mm/ms
*DEFINE_CURVE_TITLE
RG60_0x135mm/ms
*SET_NODE_LIST_TITLE
Head_Rest_Rod_Upper
*SET_NODE_LIST_TITLE
Head_Rest_Rod_Lower
*SET_NODE_LIST
*SET_NODE_LIST
*SET_NODE_LIST
*SET_NODE_LIST
*SET_NODE_LIST
*SET_NODE_LIST
*SET_PART_LIST_TITLE
Seat_BottomFoam
*SET_PART_LIST_TITLE
Seat_BackFoam
*SET_PART_LIST_TITLE
Seat_Contact
*SET_NODE_LIST
*SET_NODE_LIST
*SET_NODE_LIST
*SET_NODE_LIST
*SET_NODE_LIST
*SET_NODE_LIST
*SET_NODE_LIST
*SET_NODE_LIST
*SET_NODE_LIST
*SET_NODE_LIST
*SET_NODE_LIST
*SET_NODE_LIST
*SET_NODE_LIST
*SET_NODE_LIST
*SET_NODE_LIST
*SET_NODE_LIST
*SET_NODE_LIST
*SET_NODE_LIST
*SET_NODE_LIST
*SET_NODE_LIST
*SET_NODE_LIST
*SET_NODE_LIST
*SET_NODE_LIST
*SET_NODE_LIST
*SET_NODE_LIST
*SET_NODE_LIST
*SET_NODE_LIST
*SET_NODE_LIST
*SET_NODE_LIST
*SET_NODE_LIST
*SET_NODE_LIST
*SET_NODE_LIST
*SET_NODE_LIST
*SET_NODE_LIST
*SET_NODE_LIST
*SET_NODE_LIST
*SET_NODE_LIST
*SET_NODE_LIST
*SET_NODE_LIST
*SET_NODE_LIST
*SET_NODE_LIST
*SET_NODE_LIST
*SET_NODE_LIST
*SET_NODE_LIST
*SET_NODE_LIST
*SET_NODE_LIST
*SET_NODE_LIST
*SET_NODE_LIST
*SET_NODE_LIST
*SET_NODE_LIST
*SET_NODE_LIST
*SET_NODE_LIST
*SET_NODE_LIST
*SET_NODE_LIST
*SET_NODE_LIST
*SET_NODE_LIST
*SET_NODE_LIST
*SET_NODE_LIST
*SET_NODE_LIST
*SET_NODE_LIST
*SET_NODE_LIST
*SET_NODE_LIST
*SET_NODE_LIST
*SET_NODE_LIST
*SET_NODE_LIST
*SET_NODE_LIST
*SET_NODE_LIST
*SET_NODE_LIST
*SET_NODE_LIST
*SET_NODE_LIST
*SET_NODE_LIST
*SET_NODE_LIST
*SET_NODE_LIST
*SET_NODE_LIST
*SET_NODE_LIST
*SET_NODE_LIST
*SET_NODE_LIST
*SET_NODE_LIST
*SET_NODE_LIST
*SET_NODE_LIST
*SET_NODE_LIST
*SET_NODE_LIST
*SET_NODE_LIST
*SET_NODE_LIST
*SET_NODE_LIST
*SET_NODE_LIST
*SET_NODE_LIST
*SET_NODE_LIST
*SET_NODE_LIST
*SET_NODE_LIST
*SET_NODE_LIST
*SET_PART_LIST_TITLE
contact_part_set
*SET_PART_LIST_TITLE
Dep_SeatFoam
*SET_NODE_LIST_TITLE
Base_Cushion_Contact@_1
*SET_NODE_LIST
*SET_NODE_LIST